{"text_format":"1","workbook":"xlsx","n_sheets":16,"sheets":["Preview","Getting Started","Case Style","Categories","Assets","Assets.Misc","Assets.Notes","Liabilities","Liabilities.Misc","Liabilities.Notes","Summary","Settings","Internals","Literals","FmtCtrls","MyBuffer"],"not_rendered":{"charts":0,"images":115,"macros":1,"external_links":0,"defined_names":1,"comments":0,"pivot_tables":0},"unopened":[],"bounds":{"document_bytes":16777216,"sheet_cells":100000,"rows_first":2000,"rows_last":500,"rows_between":2000,"halvings":0,"cell_chars":16384,"cell_head_chars":4096},"cells_cut":0,"cells_raw":0,"read":"whole","date_system":"1900"}

{"sheet":"Preview","index":0,"n_rows":6,"n_cols":1,"rows_kept":6,"cut":false,"hidden":false,"merged":[[6,0,6,2],[5,0,5,2],[7,0,7,2]]}
[]
[]
[]
[]
[]
["                                                                           By OhioOakTree. Original image by Pascal Fiechter."]

{"sheet":"Getting Started","index":1,"n_rows":22,"n_cols":10,"rows_kept":22,"cut":false,"hidden":false,"merged":[[12,9,12,10],[6,9,6,16]]}
[]
[]
[]
[]
[]
[]
[null,null,null,null,null,null,null,null,null,{"$f":"CONCATENATE( Literals!B76,\"  \", Literals!B32)","v":"Welcome to the Equitable Distribution Spreadsheet  v36"}]
[]
[null,null,null,null,null,null,null,null,null,"Overview …"]
[]
[null,null,null,null,null,null,null,null,null,"Fill out your spreadsheet …"]
[]
[null,null,null,null,null,null,null,null,null,"Download the User's Guide …"]
[]
[null,null,null,null,null,null,null,null,null,"Printable (blank) forms …"]
{"$rows_left_out":8}
{"sheet":"Case Style","index":2,"n_rows":35,"n_cols":12,"rows_kept":35,"cut":false,"hidden":false,"merged":[[6,9,6,16],[11,10,11,11],[20,9,20,10],[9,10,9,18]]}
[]
[]
[]
[]
[]
[]
[null,null,null,null,null,null,null,null,null,{"$f":"CONCATENATE( Literals!D76,\"  \", Literals!B32)","v":"Equitable Distribution Spreadsheet  v36"}]
[]
[]
[null,null,null,null,null,null,null,null,null,{"$f":"Literals!B9","v":"Case Style"}]
[]
[null,null,null,null,null,null,null,null,null,{"$f":"Literals!D9","v":"Case Number"}]
[]
[null,null,null,null,null,null,null,null,null,"Date of Marriage"]
[]
{"$rows_left_out":21}
{"sheet":"Categories","index":3,"n_rows":35,"n_cols":14,"rows_kept":35,"cut":false,"hidden":true,"merged":[[6,9,6,16],[11,10,11,11],[9,10,9,11],[9,13,9,14],[10,13,10,14],[10,10,10,11]]}
[]
[]
[]
[]
[]
[]
[null,null,null,null,null,null,null,null,null,{"$f":"CONCATENATE( Literals!D76,\"  \", Literals!B32)","v":"Equitable Distribution Spreadsheet  v36"}]
[null,null,null,null,null,null,null,null,null,null,{"$f":"Literals!B78","v":"Select the categories that you wish to include in this report:"}]
[]
[null,null,null,null,null,null,null,null,null,null,{"$f":"Literals!B79","v":"Assets"},null,null,{"$f":"Literals!B80","v":"Liabilities"}]
[]
[null,null,null,null,null,null,null,null,null,null,""]
[]
[]
[]
{"$rows_left_out":21}
{"sheet":"Assets","index":4,"n_rows":70,"n_cols":18,"rows_kept":70,"cut":false,"hidden":false,"merged":[[6,1,7,1],[7,6,7,7],[7,9,7,10],[7,11,7,12],[7,14,7,15],[6,9,6,12],[6,14,6,17],[7,16,7,17],[1,3,1,17],[3,16,3,17],[6,6,6,7],[6,3,7,4],[2,6,2,7],[2,16,2,17]]}
["         Stop"]
[null,{"$f":"Literals!B9","v":"Case Style"},null,{"$f":"IF( ISBLANK( 'Case Style'!K10), \"\", 'Case Style'!K10 )","v":""}]
[null,{"$f":"Literals!D9","v":"Case Number"},null,{"$f":"IF( ISBLANK( 'Case Style'!K12), \"\", 'Case Style'!K12 )","v":""},null," "," ",null,null," "]
[null,{"$f":"Literals!B10","v":"Date of Marriage"},null,{"$f":"IF( ISBLANK( 'Case Style'!K14), \"\", 'Case Style'!K14 )","v":""},null," "," "," ",null," "]
[null,{"$f":"Literals!B11","v":"Date of Filing"},null,{"$f":"IF( ISBLANK( 'Case Style'!K16), \"\", 'Case Style'!K16)","v":""},null," "," "," ",null," "]
[null,null,null,null,null," "," "," ",null," "]
[null,{"$f":"Internals!B3","v":"Marital Assets"},null,null,null,null,{"$f":"Literals!B8","v":"Court Determined"},null,null,{"$f":"Literals!B7","v":"Valuations"},null,null,null,null,{"$f":"Literals!B19","v":"Proposed Distributions"}]
[null,null,null,null,null,null,{"$f":"Literals!D8","v":"Distributions"},null,null,{"$f":"FmtCtrls!D41","v":"Petitioner"},null,{"$f":"FmtCtrls!D42","v":"Respondent"},null,null,{"$f":"FmtCtrls!D41","v":"Petitioner"},null,{"$f":"FmtCtrls!D42","v":"Respondent"}]
[]
[]
[{"$f":"Internals!A4","v":1},{"$f":"Internals!B4","v":"Real Property"},null,{"$f":"Literals!B35","v":"Titled"},{"$f":"Literals!B36","v":"Address"},null,{"$f":"FmtCtrls!D41","v":"Petitioner"},{"$f":"FmtCtrls!D42","v":"Respondent"},null,{"$f":"Literals!B6","v":"Date"},{"$f":"Literals!B7","v":"Valuations"},{"$f":"Literals!B6","v":"Date"},{"$f":"Literals!B7","v":"Valuations"},null,{"$f":"FmtCtrls!D41","v":"Petitioner"},{"$f":"FmtCtrls!D42","v":"Respondent"},{"$f":"FmtCtrls!D41","v":"Petitioner"},{"$f":"FmtCtrls!D42","v":"Respondent"}]
["Z",{"$f":"ROW()+1-Internals!$D$4","v":1}]
["Z",{"$f":"ROW()+1-Internals!$D$4","v":2}]
["Z",null,null,null,{"$f":"Literals!B17","v":"Subtotal"},null,{"$f":"SUM( G12:G13)","v":0},{"$f":"SUM( H12:H13)","v":0},null,null,{"$f":"SUM( K12:K13)","v":0},null,{"$f":"SUM( M12:M13)","v":0},null,{"$f":"SUM( O12:O13)","v":0},{"$f":"SUM( P12:P13)","v":0},{"$f":"SUM( Q12:Q13)","v":0},{"$f":"SUM( R12:R13)","v":0}]
[]
{"$rows_left_out":56}
{"sheet":"Assets.Misc","index":5,"n_rows":25,"n_cols":18,"rows_kept":25,"cut":false,"hidden":false,"merged":[[6,14,6,17],[1,3,1,17],[3,16,3,17],[6,1,7,1],[6,3,7,4],[6,6,6,7],[7,6,7,7],[7,9,7,10],[7,11,7,12],[7,14,7,15],[7,16,7,17],[6,9,6,12],[2,6,2,7],[2,16,2,17]]}
[]
[null,{"$f":"Literals!B9","v":"Case Style"},null,{"$f":"IF( ISBLANK( 'Case Style'!K10), \"\", 'Case Style'!K10 )","v":""}]
[null,{"$f":"Literals!D9","v":"Case Number"},null,{"$f":"IF( ISBLANK( 'Case Style'!K12), \"\", 'Case Style'!K12 )","v":""},null," "," ",null,null," "]
[null,{"$f":"Literals!B10","v":"Date of Marriage"},null,{"$f":"IF( ISBLANK( 'Case Style'!K14), \"\", 'Case Style'!K14 )","v":""},null," "," "," ",null," "]
[null,{"$f":"Literals!B11","v":"Date of Filing"},null,{"$f":"IF( ISBLANK( 'Case Style'!K16), \"\", 'Case Style'!K16)","v":""},null," "," "," ",null," "]
[null,null,null,null,null," "," "," ",null," "]
[null,{"$f":"Internals!B3","v":"Marital Assets"},null,null,null,null,{"$f":"Literals!B8","v":"Court Determined"},null,null,{"$f":"Literals!B7","v":"Valuations"},null,null,null,null,{"$f":"Literals!B19","v":"Proposed Distributions"}]
[null,null,null,null,null,null,{"$f":"Literals!D8","v":"Distributions"},null,null,{"$f":"FmtCtrls!D41","v":"Petitioner"},null,{"$f":"FmtCtrls!D42","v":"Respondent"},null,null,{"$f":"FmtCtrls!D41","v":"Petitioner"},null,{"$f":"FmtCtrls!D42","v":"Respondent"}]
[]
[]
[null,{"$f":"Internals!B14","v":"Miscellaneous"},null,{"$f":"Literals!B4","v":"Possession"},{"$f":"Literals!B5","v":"Item"},null,{"$f":"FmtCtrls!D41","v":"Petitioner"},{"$f":"FmtCtrls!D42","v":"Respondent"},null,{"$f":"Literals!B6","v":"Date"},{"$f":"Literals!B7","v":"Valuations"},{"$f":"Literals!B6","v":"Date"},{"$f":"Literals!B7","v":"Valuations"},null,{"$f":"FmtCtrls!D41","v":"Petitioner"},{"$f":"FmtCtrls!D42","v":"Respondent"},{"$f":"FmtCtrls!D41","v":"Petitioner"},{"$f":"FmtCtrls!D42","v":"Respondent"}]
["Z",{"$f":"ROW()+1-Internals!$D$14","v":1}]
["Z",{"$f":"ROW()+1-Internals!$D$14","v":2}]
[null,{"$f":"ROW()+1-Internals!$D$14","v":3}]
["Z",{"$f":"ROW()+1-Internals!$D$14","v":4}]
{"$rows_left_out":11}
{"sheet":"Assets.Notes","index":6,"n_rows":28,"n_cols":9,"rows_kept":28,"cut":false,"hidden":false,"merged":[[1,3,1,6],[6,1,7,1],[6,3,7,6],[24,5,24,6],[16,5,16,6]]}
[]
[null,{"$f":"Literals!B9","v":"Case Style"},null,{"$f":"IF( ISBLANK( 'Case Style'!K10), \"\", 'Case Style'!K10 )","v":""},null,null,null,null,{"$f":"Literals!D16","v":"°"}]
[null,{"$f":"Literals!D9","v":"Case Number"},null,{"$f":"IF( ISBLANK( 'Case Style'!K12), \"\", 'Case Style'!K12 )","v":""}]
[null,{"$f":"Literals!B10","v":"Date of Marriage"},null,{"$f":"IF( ISBLANK( 'Case Style'!K14), \"\", 'Case Style'!K14 )","v":""}]
[null,{"$f":"Literals!B11","v":"Date of Filing"},null,{"$f":"IF( ISBLANK( 'Case Style'!K16), \"\", 'Case Style'!K16)","v":""}]
[]
[null,{"$f":"Literals!B21","v":"Asset Notes"}]
[]
[]
[]
[null,{"$f":"FmtCtrls!D41","v":"Petitioner"},null,{"$f":"Literals!B18","v":"Category"},{"$f":"Literals!B25","v":"Asset"},{"$f":"Literals!B6","v":"Date"},{"$f":"Literals!B20","v":"Notes"}]
["Z",{"$f":"ROW()+1-Internals!$D$30","v":1}]
["Z",{"$f":"ROW()+1-Internals!$D$30","v":2}]
["Z",{"$f":"ROW()+1-Internals!$D$30","v":3}]
["Z",{"$f":"ROW()+1-Internals!$D$30","v":4}]
{"$rows_left_out":14}
{"sheet":"Liabilities","index":7,"n_rows":49,"n_cols":18,"rows_kept":49,"cut":false,"hidden":false,"merged":[[6,14,6,17],[1,3,1,17],[3,16,3,17],[6,1,7,1],[6,3,7,4],[6,6,6,7],[7,6,7,7],[7,9,7,10],[7,11,7,12],[7,14,7,15],[7,16,7,17],[6,9,6,12],[2,6,2,7],[2,16,2,17]]}
[]
[null,{"$f":"Literals!B9","v":"Case Style"},null,{"$f":"IF( ISBLANK( 'Case Style'!K10), \"\", 'Case Style'!K10 )","v":""}]
[null,{"$f":"Literals!D9","v":"Case Number"},null,{"$f":"IF( ISBLANK( 'Case Style'!K12), \"\", 'Case Style'!K12 )","v":""},null," "," ",null,null," "]
[null,{"$f":"Literals!B10","v":"Date of Marriage"},null,{"$f":"IF( ISBLANK( 'Case Style'!K14), \"\", 'Case Style'!K14 )","v":""},null," "," "," ",null," "]
[null,{"$f":"Literals!B11","v":"Date of Filing"},null,{"$f":"IF( ISBLANK( 'Case Style'!K16), \"\", 'Case Style'!K16)","v":""},null," "," "," ",null," "]
[null,null,null,null,null," "," "," ",null," "]
[null,{"$f":"Internals!B18","v":"Marital Liabilities"},null,null,null,null,{"$f":"Literals!B8","v":"Court Determined"},null,null,{"$f":"Literals!B7","v":"Valuations"},null,null,null,null,{"$f":"Literals!B19","v":"Proposed Distributions"}]
[null,null,null,null,null,null,{"$f":"Literals!D8","v":"Distributions"},null,null,{"$f":"FmtCtrls!D41","v":"Petitioner"},null,{"$f":"FmtCtrls!D42","v":"Respondent"},null,null,{"$f":"FmtCtrls!D41","v":"Petitioner"},null,{"$f":"FmtCtrls!D42","v":"Respondent"}]
[]
[]
[{"$f":"Internals!A4","v":1},{"$f":"Internals!B19","v":"Mortgage"},null,{"$f":"Literals!B38","v":"Signor"},{"$f":"Literals!B37","v":"Institution  +  last 4"},null,{"$f":"FmtCtrls!D41","v":"Petitioner"},{"$f":"FmtCtrls!D42","v":"Respondent"},null,{"$f":"Literals!B6","v":"Date"},{"$f":"Literals!B7","v":"Valuations"},{"$f":"Literals!B6","v":"Date"},{"$f":"Literals!B7","v":"Valuations"},null,{"$f":"FmtCtrls!D41","v":"Petitioner"},{"$f":"FmtCtrls!D42","v":"Respondent"},{"$f":"FmtCtrls!D41","v":"Petitioner"},{"$f":"FmtCtrls!D42","v":"Respondent"}]
["Z",{"$f":"ROW()+1-Internals!$D$19","v":1}]
["Z",{"$f":"ROW()+1-Internals!$D$19","v":2}]
[null,null,null,null,{"$f":"Literals!B17","v":"Subtotal"},null,{"$f":"SUM( G12:G13)","v":0},{"$f":"SUM( H12:H13)","v":0},null,null,{"$f":"SUM( K12:K13)","v":0},null,{"$f":"SUM( M12:M13)","v":0},null,{"$f":"SUM( O12:O13)","v":0},{"$f":"SUM( P12:P13)","v":0},{"$f":"SUM( Q12:Q13)","v":0},{"$f":"SUM( R12:R13)","v":0}]
[]
{"$rows_left_out":35}
{"sheet":"Liabilities.Misc","index":8,"n_rows":25,"n_cols":18,"rows_kept":25,"cut":false,"hidden":false,"merged":[[6,14,6,17],[1,3,1,17],[3,16,3,17],[6,1,7,1],[6,3,7,4],[6,6,6,7],[7,6,7,7],[7,9,7,10],[7,11,7,12],[7,14,7,15],[7,16,7,17],[6,9,6,12],[2,6,2,7],[2,16,2,17]]}
[]
[null,{"$f":"Literals!B9","v":"Case Style"},null,{"$f":"IF( ISBLANK( 'Case Style'!K10), \"\", 'Case Style'!K10 )","v":""}]
[null,{"$f":"Literals!D9","v":"Case Number"},null,{"$f":"IF( ISBLANK( 'Case Style'!K12), \"\", 'Case Style'!K12 )","v":""},null," "," ",null,null," "]
[null,{"$f":"Literals!B10","v":"Date of Marriage"},null,{"$f":"IF( ISBLANK( 'Case Style'!K14), \"\", 'Case Style'!K14)","v":""},null," "," "," ",null," "]
[null,{"$f":"Literals!B11","v":"Date of Filing"},null,{"$f":"IF( ISBLANK( 'Case Style'!K16), \"\", 'Case Style'!K16)","v":""},null," "," "," ",null," "]
[null,null,null,null,null," "," "," ",null," "]
[null,{"$f":"Internals!B18","v":"Marital Liabilities"},null,null,null,null,{"$f":"Literals!B8","v":"Court Determined"},null,null,{"$f":"Literals!B7","v":"Valuations"},null,null,null,null,{"$f":"Literals!B19","v":"Proposed Distributions"}]
[null,null,null,null,null,null,{"$f":"Literals!D8","v":"Distributions"},null,null,{"$f":"FmtCtrls!D41","v":"Petitioner"},null,{"$f":"FmtCtrls!D42","v":"Respondent"},null,null,{"$f":"FmtCtrls!D41","v":"Petitioner"},null,{"$f":"FmtCtrls!D42","v":"Respondent"}]
[]
[]
[null,{"$f":"Internals!B26","v":"Miscellaneous"},null,{"$f":"Literals!B4","v":"Possession"},{"$f":"Literals!B5","v":"Item"},null,{"$f":"FmtCtrls!D41","v":"Petitioner"},{"$f":"FmtCtrls!D42","v":"Respondent"},null,{"$f":"Literals!B6","v":"Date"},{"$f":"Literals!B7","v":"Valuations"},{"$f":"Literals!B6","v":"Date"},{"$f":"Literals!B7","v":"Valuations"},null,{"$f":"FmtCtrls!D41","v":"Petitioner"},{"$f":"FmtCtrls!D42","v":"Respondent"},{"$f":"FmtCtrls!D41","v":"Petitioner"},{"$f":"FmtCtrls!D42","v":"Respondent"}]
["Z",{"$f":"ROW()+1-Internals!$D$26","v":1}]
["Z",{"$f":"ROW()+1-Internals!$D$26","v":2}]
[null,{"$f":"ROW()+1-Internals!$D$26","v":3}]
["Z",{"$f":"ROW()+1-Internals!$D$26","v":4}]
{"$rows_left_out":11}
{"sheet":"Liabilities.Notes","index":9,"n_rows":28,"n_cols":9,"rows_kept":28,"cut":false,"hidden":false,"merged":[[1,3,1,6],[6,1,7,1],[6,3,7,6],[24,5,24,6],[16,5,16,6]]}
[]
[null,{"$f":"Literals!B9","v":"Case Style"},null,{"$f":"IF( ISBLANK( 'Case Style'!K10), \"\", 'Case Style'!K10 )","v":""},null,null,null,null,{"$f":"Literals!D16","v":"°"}]
[null,{"$f":"Literals!D9","v":"Case Number"},null,{"$f":"IF( ISBLANK( 'Case Style'!K12), \"\", 'Case Style'!K12 )","v":""}]
[null,{"$f":"Literals!B10","v":"Date of Marriage"},null,{"$f":"IF( ISBLANK( 'Case Style'!K14), \"\", 'Case Style'!K14)","v":""}]
[null,{"$f":"Literals!B11","v":"Date of Filing"},null,{"$f":"IF( ISBLANK( 'Case Style'!K16), \"\", 'Case Style'!K16)","v":""}]
[]
[null,{"$f":"Literals!B22","v":"Liability Notes"}]
[]
[]
[]
[null,{"$f":"FmtCtrls!D41","v":"Petitioner"},null,{"$f":"Literals!B18","v":"Category"},{"$f":"Literals!B26","v":"Liability"},{"$f":"Literals!B6","v":"Date"},{"$f":"Literals!B20","v":"Notes"}]
["Z",{"$f":"ROW()+1-Internals!$D$35","v":1}]
["Z",{"$f":"ROW()+1-Internals!$D$35","v":2}]
["Z",{"$f":"ROW()+1-Internals!$D$35","v":3}]
["Z",{"$f":"ROW()+1-Internals!$D$35","v":4}]
{"$rows_left_out":14}
{"sheet":"Summary","index":10,"n_rows":20,"n_cols":11,"rows_kept":20,"cut":false,"hidden":false,"merged":[[6,1,7,1],[1,3,1,8],[7,5,7,6],[7,7,7,8],[6,3,6,4],[7,3,7,4],[6,5,6,6],[6,7,6,8]]}
[]
[null,{"$f":"Literals!B9","v":"Case Style"},null,{"$f":"IF( ISBLANK( 'Case Style'!K10), \"\", 'Case Style'!K10 )","v":""},null,null,null,null,null,null,{"$f":"Literals!D16","v":"°"}]
[null,{"$f":"Literals!D9","v":"Case Number"},null,{"$f":"IF( ISBLANK( 'Case Style'!K12), \"\", 'Case Style'!K12 )","v":""}]
[null,{"$f":"Literals!B10","v":"Date of Marriage"},null,{"$f":"IF( ISBLANK( 'Case Style'!K14), \"\", 'Case Style'!K14 )","v":""}]
[null,{"$f":"Literals!B11","v":"Date of Filing"},null,{"$f":"IF( ISBLANK( 'Case Style'!K16), \"\", 'Case Style'!K16)","v":""}]
[]
[null,{"$f":"Literals!B28","v":"Summary"},null,{"$f":"Literals!B8","v":"Court Determined"},null,{"$f":"Literals!B19","v":"Proposed Distributions"},null,{"$f":"Literals!B19","v":"Proposed Distributions"}]
[null,null,null,{"$f":"Literals!B23","v":"Distribution"},null,"Husband",null,{"$f":"FmtCtrls!D42","v":"Respondent"}]
[null,null,null,{"$f":"FmtCtrls!D41","v":"Petitioner"},{"$f":"FmtCtrls!D42","v":"Respondent"},{"$f":"FmtCtrls!D41","v":"Petitioner"},{"$f":"FmtCtrls!D42","v":"Respondent"},{"$f":"FmtCtrls!D41","v":"Petitioner"},{"$f":"FmtCtrls!D42","v":"Respondent"}]
[]
[null,{"$f":"Internals!B12","v":"Total Assets"},null,{"$f":"SUM(Assets!G67,Assets.Misc!G22)","v":0},{"$f":"SUM(Assets!H67,Assets.Misc!H22)","v":0},{"$f":"SUM(Assets!O67,Assets.Misc!O22)","v":0},{"$f":"SUM(Assets!P67,Assets.Misc!P22)","v":0},{"$f":"SUM(Assets!Q67,Assets.Misc!Q22)","v":0},{"$f":"SUM(Assets!R67,Assets.Misc!R22)","v":0}]
[null,{"$f":"Internals!B24","v":"Total Liabilities"},null,{"$f":"SUM(Liabilities!G46,Liabilities.Misc!G22)","v":0},{"$f":"SUM(Liabilities!H46,Liabilities.Misc!H22)","v":0},{"$f":"SUM(Liabilities!O46,Liabilities.Misc!O22)","v":0},{"$f":"SUM(Liabilities!P46,Liabilities.Misc!P22)","v":0},{"$f":"SUM(Liabilities!Q46,Liabilities.Misc!Q22)","v":0},{"$f":"SUM(Liabilities!R46,Liabilities.Misc!R22)","v":0}]
[null,{"$f":"Internals!B44","v":"Net"},null,{"$f":"SUM(D11:D12)","v":0},0,0,0,0,0]
[]
[null,{"$f":"Literals!B12","v":"Equalizing Payment"},null,{"$f":"IF( D13>E13, -Internals!C45, Internals!C45 )","v":0},{"$f":"IF( E13>D13, -Internals!C45, Internals!C45 )","v":0},{"$f":"IF( F13>G13, -Internals!C46, Internals!C46 )","v":0},{"$f":"IF( G13>F13, -Internals!C46, Internals!C46 )","v":0},{"$f":"IF( H13>I13, -Internals!C47, Internals!C47 )","v":0},{"$f":"IF( I13>H13, -Internals!C47, Internals!C47 )","v":0}]
{"$rows_left_out":6}
{"sheet":"Settings","index":11,"n_rows":5,"n_cols":19,"rows_kept":5,"cut":false,"hidden":false,"merged":[[4,9,4,10],[5,9,5,10]]}
[]
[null,"Layout Options",null,null,"Print Options",null,null,null,null,"Tool Options",null,null,null,null,"Input/Output Options",null,null,null,"Review Options"]
[]
[]
[null,null,null,null,null,null,null,null,null,"    Add increment",null,1]

{"sheet":"Internals","index":12,"n_rows":47,"n_cols":12,"rows_kept":47,"cut":false,"hidden":true,"merged":[]}
[]
[null,"Assets","Header","Data[1]","Data[n]","Subtotal","# Rows","# Default","Display","EQ\nDisplay","Assets Drop list","EQ\nSubtotal"]
[null,"Marital Assets",{"$f":"MATCH(B3,Assets!B:B,0)","v":7},".",".","."]
[1,"Real Property",{"$f":"MATCH(B4,Assets!B:B,0)","v":11},{"$f":"SUM(C4,1)","v":12},{"$f":"SUM(C5,-C40)","v":13},{"$f":"SUM(E4,1)","v":14},{"$f":"E4-D4+1","v":2},2,true,true,{"$f":"B4","v":"Real Property"},{"$f":"F4+2","v":16}]
[{"$f":"A4+1","v":2},"Accounts",{"$f":"MATCH(B5,Assets!B:B,0)","v":18},19,{"$f":"SUM(C6,-C40)","v":20},21,2,2,true,true,"Accounts",{"$f":"F5+2","v":23}]
[3,"Retirement",{"$f":"MATCH(B6,Assets!B:B,0)","v":25},26,{"$f":"SUM(C7,-C40)","v":27},28,2,2,true,true,"Retirement",30]
[4,"Pre-Tax Retirement",{"$f":"MATCH(B7,Assets!B:B,0)","v":32},{"$f":"SUM(C7,1)","v":33},{"$f":"SUM(C8,-C40)","v":34},{"$f":"SUM(E7,1)","v":35},{"$f":"E7-D7+1","v":2},2,true,true,{"$f":"B7","v":"Pre-Tax Retirement"},37]
[5,"Business Interests",{"$f":"MATCH(B8,Assets!B:B,0)","v":39},40,{"$f":"SUM(C9,-C40)","v":41},42,2,2,true,true,"Business Interests",44]
[6,"Personal Property",{"$f":"MATCH(B9,Assets!B:B,0)","v":46},47,{"$f":"SUM(C10,-C40)","v":48},49,2,2,true,true,"Personal Property",51]
[7,"Vehicles",{"$f":"MATCH(B10,Assets!B:B,0)","v":53},54,{"$f":"SUM(C11,-C40)","v":55},56,2,2,true,true,{"$f":"B10","v":"Vehicles"},58]
[8,"Contingent Assets",{"$f":"MATCH(B11,Assets!B:B,0)","v":60},{"$f":"SUM(C11,1)","v":61},{"$f":"SUM(C12,-C40)","v":62},{"$f":"SUM(E11,1)","v":63},{"$f":"E11-D11+1","v":2},2,false,true,{"$f":"B11","v":"Contingent Assets"},65]
[null,"Total Assets",{"$f":"MATCH(B12,Assets!B:B,0)","v":67},{"$f":"C12","v":67},{"$f":"C12","v":67},{"$f":"C12","v":67},{"$f":"SUM(G4:G11)","v":16},null,true,true,{"$f":"B14","v":"Miscellaneous"},69]
[]
[{"$f":"A11+1","v":9},"Miscellaneous",{"$f":"MATCH(B14,Assets.Misc!B:B,0)","v":11},{"$f":"SUM(C14,1)","v":12},{"$f":"SUM(C15,-C40)","v":17},{"$f":"SUM(E14,1)","v":18},{"$f":"E14-D14+1","v":6},6,true,true,null,{"$f":"F14+2","v":20}]
[null,"Total Miscellaneous",{"$f":"MATCH(B15,Assets.Misc!B:B,0)","v":22},{"$f":"C15","v":22},{"$f":"C15","v":22},{"$f":"C15","v":22},{"$f":"G14","v":6},null,true,true]
{"$rows_left_out":33}
{"sheet":"Literals","index":13,"n_rows":80,"n_cols":5,"rows_kept":80,"cut":false,"hidden":true,"merged":[]}
[]
[null,"Miscellaneous"]
[null,"Type"]
[null,"Possession"]
[null,"Item"]
[null,"Date"]
[null,"Valuations",null,"Valuation"]
[null,"Court Determined",null,"Distributions"]
[null,"Case Style",null,"Case Number"]
[null,"Date of Marriage",null,{"$f":"CONCATENATE(B45,\" | \",B46,\" | \",B47,\" | \",B48,\" | \",B49)","v":"Husband | Wife | Joint | Petitioner | Respondent"}]
[null,"Date of Filing"]
[null,"Equalizing Payment"]
[null,"Disparity"]
[null,{"$f":"CONCATENATE(\"• eQuit \",B32,\"  \",E14)","v":"• eQuit v36  © 2019  Diana M. Tennis"},null,"eQuit","© 2019  Diana M. Tennis"]
[null,"• Subtotal"]
{"$rows_left_out":66}
{"sheet":"FmtCtrls","index":14,"n_rows":70,"n_cols":8,"rows_kept":70,"cut":false,"hidden":true,"merged":[]}
[]
[null,"Settings"]
[null,"Columns:Valuations",true]
[null,"Columns:Proposed Distributions",true]
[null,"Columns:Court Distributions",true]
[null,"Lock Entire Row",false]
[null,"Expand Description",true]
[null,"Simulate:Selected Row",false]
[null,"Print:All sheets",false]
[null,"Print:Minimalist",1]
[null,"Simulate:Multi-line descriptions",false]
[null,"Reformat on lock",false]
[null,"Lock:Petitioner",false]
[null,"Lock:Respondent",false]
[null,"Lock:Joint",false]
{"$rows_left_out":56}
{"sheet":"MyBuffer","index":15,"n_rows":0,"n_cols":0,"rows_kept":0,"cut":false,"hidden":true,"merged":[]}